HOOH..NO3 anion

Gas phase thermochemistry data

Data compiled by: John E. Bartmess

Quantity Value Units Method Reference Comment
Δfgas-522.6 ± 4.6kJ/molTherBohringer, Fahey, et al., 1984Relative to HOH..NO3-, Keesee, Lee, et al., 1980

References

Bohringer, Fahey, et al., 1984
Bohringer, H.; Fahey, D.W.; Fehsenfeld, F.C.; Ferguson, E.E., Bond energies of the molecules H2O, SO2, H2O2, and HCl to various atmospheric negative ions, J. Chem. Phys., 1984, 81, 2805. [all data]

Keesee, Lee, et al., 1980
Keesee, R.G.; Lee, N.; Castleman, A.W., Jr., Properties of clusters in the gas phase: V. Complexes of neutral molecules onto negative ions, J. Chem. Phys., 1980, 73, 2195. [all data]