tantalum tetrachloride anion

Gas phase thermochemistry data

Data compiled by: John E. Bartmess

Quantity Value Units Method Reference Comment
Δfgas<-166.29kcal/molR-EABennett, Margrave, et al., 1975From TaCl5

References

Bennett, Margrave, et al., 1975
Bennett, S.L.; Margrave, J.L.; Franklin, J.L., Negative ion electron impact studies of inorganic halides. Niobium and tantalum pentachlorides, J. Inorg. Nucl. Chem., 1975, 37, 937. [all data]