HBr..NO3 anion

Gas phase thermochemistry data

Data compiled by: John E. Bartmess

Quantity Value Units Method Reference Comment
Δfgas-445. ± 13.kJ/molTherDavidson, Fehsenfeld, et al., 1977Anchored to HBr..Br- in Caldwell and Kebarle, 1985.

References

Davidson, Fehsenfeld, et al., 1977
Davidson, J.A.; Fehsenfeld, F.C.; Howard, C.J., The heats of formation of NO3- and NO3- association complexes with HNO3 and HBr, Int. J. Chem. Kinet., 1977, 9, 17. [all data]

Caldwell and Kebarle, 1985
Caldwell, G.; Kebarle, P., The hydrogen bond energies of the bihalide ions XHX- and YHX-, Can. J. Chem., 1985, 63, 1399. [all data]