MeSOMe..Br anion

Gas phase thermochemistry data

Data compiled by: John E. Bartmess

Quantity Value Units Method Reference Comment
Δfgas-436.35kJ/molTherMagnera, Caldwell, et al., 1984

References

Magnera, Caldwell, et al., 1984
Magnera, T.F.; Caldwell, G.; Sumner, J.; Ikuta, S.; Kebarle, P., Solvation of the halide anions in dimethyl sulfoxide. Factors involved in enhanced reactivity of negative ions in dipolar aprotic solvents, J. Am. Chem. Soc., 1984, 106, 6140. [all data]