MeCN..I anion

Gas phase thermochemistry data

Data compiled by: John E. Bartmess

Quantity Value Units Method Reference Comment
Δfgas-163. ± 8.4kJ/molTherYamdagni and Kebarle, 1972

Gas phase ion energetics data

Data compiled by: John E. Bartmess

Electron affinity of neutral species

EAneutral (eV) Method Reference Comment
3.539 ± 0.015LPESMarkovich, Perera, et al., 1996

References

Yamdagni and Kebarle, 1972
Yamdagni, R.; Kebarle, P., Solvation of negative ions by protic and aprotic solvents. Gas phase solvation of halide ions by acetonitrile and water molecules, J. Am. Chem. Soc., 1972, 94, 2940. [all data]

Markovich, Perera, et al., 1996
Markovich, G.; Perera, L.; Berkowitz, M.L.; Cheshnovsky, O., The Solvation of Cl-, Br-, and I- in Acetonitrile Cluster: Photoelectron Spectroscopy and Molecular Dynamics Simulations., J. Chem. Phys., 1996, 105, 7, 2675, https://doi.org/10.1063/1.472131 . [all data]