Te2 anion

Gas phase thermochemistry data

Data compiled by: John E. Bartmess

Quantity Value Units Method Reference Comment
Δfgas-17. ± 11.kJ/molR-EASnodgrass, Coe, et al., 1989

References

Snodgrass, Coe, et al., 1989
Snodgrass, J.T.; Coe, J.V.; McHugh, K.M.; Freidhoff, C.B.; Bowen, K.H., Photoelectron Spectroscopy of the Selenium and Tellurium Containing Negative Ions: SeO2-, Se2- and Te2-, J. Phys. Chem., 1989, 93, 4, 1249, https://doi.org/10.1021/j100341a016 . [all data]