Dichlobenil anion

Gas phase thermochemistry data

Data compiled by: John E. Bartmess

Quantity Value Units Method Reference Comment
Δfgas97.1 ± 9.2kJ/molR-EAChowdhury and Kebarle, 1986ΔGea(423 K) = -16.7 kcal/mol; ΔSea(estimated) = +1.7 eu

References

Chowdhury and Kebarle, 1986
Chowdhury, S.; Kebarle, P., Electron affinities of di- and tetracyanoethylene and cyanobenzenes based on measurements of gas-phase electron transfer equilibria, J. Am. Chem. Soc., 1986, 108, 5453. [all data]