H2O..NO3 anion

Gas phase thermochemistry data

Data compiled by: John E. Bartmess

Quantity Value Units Method Reference Comment
Δfgas-609.2 ± 1.5kJ/molTherLee, Keesee, et al., 1980

References

Lee, Keesee, et al., 1980
Lee, N.; Keesee, R.G.; Castleman, A.W., Jr., The properties of clusters in the gas phase. IV. Complexes of H2O and HNOx clustering on NOx-, J. Chem. Phys., 1980, 72, 1089. [all data]