Me2CO..Cl anion

Gas phase thermochemistry data

Data compiled by: John E. Bartmess

Quantity Value Units Method Reference Comment
Δfgas-120.32kcal/molTherBofdanov and McMahon, 2002

References

Bofdanov and McMahon, 2002
Bofdanov, B.; McMahon, T.B., Structures, Thermochemistry, and Infrared Spectra of Chloride Ion-Fluorinated Acetone Complexes and Neutral Fluorinated Acetones in the Gas Phase: Experiment and Theory, Int. J. Mass Spectrom., 2002, 219, 3, 593-613, https://doi.org/10.1016/S1387-3806(02)00745-5 . [all data]