(CF2H)2O..Cl anion

Reaction thermochemistry data

Data compiled by: John E. Bartmess

Individual Reactions

C2H2ClF4O- + 21,1,1',1'-Tetrafluorodimethyl ether = C4H4ClF8O2-

By formula: C2H2ClF4O- + 2C2H2F4O = C4H4ClF8O2-

Quantity Value Units Method Reference Comment
Δr89.5 ± 1.7kJ/molTDAsBogdanov, Lee, et al., 2001gas phase
Quantity Value Units Method Reference Comment
Δr47.3 ± 4.2kJ/molTDAsBogdanov, Lee, et al., 2001gas phase

Ion clustering data

Data compiled by: John E. Bartmess

Clustering reactions

C2H2ClF4O- + 21,1,1',1'-Tetrafluorodimethyl ether = C4H4ClF8O2-

By formula: C2H2ClF4O- + 2C2H2F4O = C4H4ClF8O2-

Quantity Value Units Method Reference Comment
Δr89.5 ± 1.7kJ/molTDAsBogdanov, Lee, et al., 2001gas phase
Quantity Value Units Method Reference Comment
Δr47.3 ± 4.2kJ/molTDAsBogdanov, Lee, et al., 2001gas phase

References

Bogdanov, Lee, et al., 2001
Bogdanov, B.; Lee, H.J.S.; McMahon, T.B., Influence of fluorine substitution on the structures and thermochemistry of chloride ion-ether complexes in the gas phase, Int. J. Mass Spectrom., 2001, 210, 387-402, https://doi.org/10.1016/S1387-3806(01)00404-3 . [all data]