SnF3 anion

Reaction thermochemistry data

Data compiled by: John E. Bartmess

Individual Reactions

F3Sn- + Hydrogen cation = HF3Sn

By formula: F3Sn- + H+ = HF3Sn

Quantity Value Units Method Reference Comment
Δr300.90kcal/molN/ACheck, Faust, et al., 2001gas phase; NiH-; ; ΔS(EA)=3.9
Quantity Value Units Method Reference Comment
Δr293.00kcal/molN/ACheck, Faust, et al., 2001gas phase; NiH-; ; ΔS(EA)=3.9

Gas phase ion energetics data

Data compiled by: John E. Bartmess

Electron affinity of neutral species

EAneutral (eV) Method Reference Comment
2.64998EIAEFranklin, Wang, et al., 1974From SnF4
>1.19997EIAEPabst, Perry, et al., 1977From SnF4
>1.19997EIAEBennett, Wang, et al., 1975From SnF4
3.92771N/ACheck, Faust, et al., 2001NiH-; ; ΔS(EA)=3.9

Protonation reactions

F3Sn- + Hydrogen cation = HF3Sn

By formula: F3Sn- + H+ = HF3Sn

Quantity Value Units Method Reference Comment
Δr300.90kcal/molN/ACheck, Faust, et al., 2001gas phase; NiH-; ; ΔS(EA)=3.9
Quantity Value Units Method Reference Comment
Δr293.00kcal/molN/ACheck, Faust, et al., 2001gas phase; NiH-; ; ΔS(EA)=3.9

References

Check, Faust, et al., 2001
Check, C.E.; Faust, T.O.; Bailey, J.M.; Wright, B.J.; Gilbert, T.M.; Sunderlin, L.S., Addition of Polarization and Diffuse Functions to the LANL2DZ Basis Set for P-Block Elements, J. Phys. Chem. A,, 2001, 105, 34, 8111, https://doi.org/10.1021/jp011945l . [all data]

Franklin, Wang, et al., 1974
Franklin, J.L.; Wang, J.L.-F.; Bennett, S.L.; Harland, P.W.; Margrave, J.L., Studies of the energies of negative ions at high temperatures, Adv. Mass Spectrom., 1974, 6, 319. [all data]

Pabst, Perry, et al., 1977
Pabst, R.E.; Perry, D.L.; Margrave, J.L.; Franklin, J.L., Electron impact studies of tin tetrahalides SnCl4, SnBr4 and SnI4, Int. J. Mass Spectrom. Ion Phys., 1977, 24, 323. [all data]

Bennett, Wang, et al., 1975
Bennett, S.L.; Wang, J.L.; Margrave, J.L.; Franklin, J.L., High temperature negative ions. The enthalpies of formation of gaseous PbF3 and SnF3 from low-energy electron impact studies, High Temp. Sci., 1975, 7, 142. [all data]