c-(CH2)3Si(Me)2..F anion

Gas phase thermochemistry data

Data compiled by: John E. Bartmess

Quantity Value Units Method Reference Comment
Δfgas-130.2 ± 3.5kcal/molTherSullivan, DePuy, et al., 1981

References

Sullivan, DePuy, et al., 1981
Sullivan, S.A.; DePuy, C.H.; Damrauer, R., Gas Phase Reactions of Cyclic Silanes, J. Am. Chem. Soc., 1981, 103, 2, 480, https://doi.org/10.1021/ja00392a048 . [all data]