2,3,5,6-Tetrafluoroanisole anion

Gas phase thermochemistry data

Data compiled by: John E. Bartmess

Quantity Value Units Method Reference Comment
Δfgas-196.9 ± 2.2kcal/molR-EAHernandez-Gill, Wentworth, et al., 1984

References

Hernandez-Gill, Wentworth, et al., 1984
Hernandez-Gill, N.; Wentworth, W.E.; Chen, E.C.M., Electron affinities of fluorinated phenoxy radicals, J. Phys. Chem., 1984, 88, 6181. [all data]