H2O..MeO anion

Reaction thermochemistry data

Data compiled by: John E. Bartmess

Individual Reactions

CH5O2- + 2Water = CH7O3-

By formula: CH5O2- + 2H2O = CH7O3-

Quantity Value Units Method Reference Comment
Δr80.3 ± 4.2kJ/molTDAsMeot-Ner(Mautner), 1986gas phase
Quantity Value Units Method Reference Comment
Δr49.0 ± 2.1kJ/molTDAsMeot-Ner(Mautner), 1986gas phase

Gas phase thermochemistry data

Data compiled by: John E. Bartmess

Quantity Value Units Method Reference Comment
Δfgas-472.2 ± 2.3kJ/molTherMeot-ner and Sieck, 1986

References

Meot-Ner(Mautner), 1986
Meot-Ner(Mautner), M., Comparative Stabilities of Cationic and Anionic Hydrogen-Bonded Networks. Mixed Clusters of Water-Methanol, J. Am. Chem. Soc., 1986, 108, 20, 6189, https://doi.org/10.1021/ja00280a014 . [all data]