H2O..Cl anion

Gas phase thermochemistry data

Data compiled by: John E. Bartmess

Quantity Value Units Method Reference Comment
Δfgas-531.49kJ/molTherKeesee and Castleman, 1980

Gas phase ion energetics data

Data compiled by: John E. Bartmess

Electron affinity of neutral species

EAneutral (eV) Method Reference Comment
4.37 ± 0.10LPESMarkovich, Pollack, et al., 1994For photodissociation plus electron loss. Affinity is difference from lower solvated ion.

References

Keesee and Castleman, 1980
Keesee, R.G.; Castleman, A.W., Jr., Gas phase studies of hydration complexes of Cl- and I- and comparison to electrostatic calculations in the gas phase, Chem. Phys. Lett., 1980, 74, 139. [all data]

Markovich, Pollack, et al., 1994
Markovich, G.; Pollack, S.; Giniger, R.; Cheshnovsky, O., Photoelectron spectroscopy of Cl-, Br-, and I- solvated in water clusters, J. Chem. Phys., 1994, 101, 11, 9344, https://doi.org/10.1063/1.467965 . [all data]