HCO2CH2 anion

Reaction thermochemistry data

Data compiled by: John E. Bartmess

Individual Reactions

C2H3O2- + Hydrogen cation = Methyl formate

By formula: C2H3O2- + H+ = C2H4O2

Quantity Value Units Method Reference Comment
Δr1637. ± 17.kJ/molG+TSDePuy, Grabowski, et al., 1985gas phase
Quantity Value Units Method Reference Comment
Δr1607. ± 17.kJ/molIMRBDePuy, Grabowski, et al., 1985gas phase

References

DePuy, Grabowski, et al., 1985
DePuy, C.H.; Grabowski, J.J.; Bierbaum, V.M.; Ingemann, S.; Nibbering, N.M.M., Gas-phase reactions of anions with methyl formate and N,N-dimethylformamide, J. Am. Chem. Soc., 1985, 107, 1093. [all data]