MeN(NO)CH2 anion

Gas phase ion energetics data

Data compiled by: John E. Bartmess

Protonation reactions

C2H5N2O- + Hydrogen cation = N-Nitrosodimethylamine

By formula: C2H5N2O- + H+ = C2H6N2O

Quantity Value Units Method Reference Comment
Δr380.9 ± 2.1kcal/molG+TSIngemann and Nibbering, 1985gas phase; The experimental dHf(Me2NNO) { Korsunskii, Pepekin, et al., 1967} is incorrect: JEB, manuscript in preparation; value altered from reference due to change in acidity scale
Quantity Value Units Method Reference Comment
Δr373.8 ± 2.0kcal/molIMREIngemann and Nibbering, 1985gas phase; The experimental dHf(Me2NNO) { Korsunskii, Pepekin, et al., 1967} is incorrect: JEB, manuscript in preparation; value altered from reference due to change in acidity scale

References

Ingemann and Nibbering, 1985
Ingemann, S.; Nibbering, N.M.M., Gas phase chemistry of dipole stabilized carbanions derived from N,N-dimethylthioformamide and N,N-dimethylnitrosamine, Acta Chem. Scand., Ser. B, 1985, 39, 697. [all data]

Korsunskii, Pepekin, et al., 1967
Korsunskii, B.L.; Pepekin, V.I.; Lebedev, Yu.A.; Apin, A.Ya., Bull. Acad. Sci. USSR Div. Chem. Sci., 1967, 509. [all data]