MnF4..F anion

Gas phase thermochemistry data

Data compiled by: John E. Bartmess

Quantity Value Units Method Reference Comment
Δfgas-1560. ± 84.kJ/molTherKorobov, Chilingarov, et al., 1984Fluoride Affinity: 17.5 kcal < MnF3; value altered from reference due to conversion from electron convention to ion convention

References

Korobov, Chilingarov, et al., 1984
Korobov, M.V.; Chilingarov, N.S.; Igolkina, N.A.; Nikitin, M.I.; Sidorov, L.N., Molecules with a high electron affinity. Negative ions in the saturated vapor of the platinum-manganese trifluoride system, Russ. J. Phys. Chem., 1984, 58, 1368. [all data]