mCF3-benzoate anion

Reaction thermochemistry data

Data compiled by: John E. Bartmess

Individual Reactions

C8H4F3O2- + Hydrogen cation = 3-(Trifluoromethyl)benzoic acid

By formula: C8H4F3O2- + H+ = C8H5F3O2

Quantity Value Units Method Reference Comment
Δr1390. ± 8.8kJ/molG+TSTaft, 1987gas phase; value altered from reference due to change in acidity scale
Quantity Value Units Method Reference Comment
Δr1361. ± 8.4kJ/molIMRETaft, 1987gas phase; value altered from reference due to change in acidity scale

Gas phase ion energetics data

Data compiled by: John E. Bartmess

Electron affinity of neutral species

EAneutral (eV) Method Reference Comment
4.09 ± 0.16D-EATaft, 1987value altered from reference due to change in acidity scale

Protonation reactions

C8H4F3O2- + Hydrogen cation = 3-(Trifluoromethyl)benzoic acid

By formula: C8H4F3O2- + H+ = C8H5F3O2

Quantity Value Units Method Reference Comment
Δr1390. ± 8.8kJ/molG+TSTaft, 1987gas phase; value altered from reference due to change in acidity scale
Quantity Value Units Method Reference Comment
Δr1361. ± 8.4kJ/molIMRETaft, 1987gas phase; value altered from reference due to change in acidity scale

References

Taft, 1987
Taft, R.W., The Nature and Analysis of Substitutent Electronic Effects, Personal communication. See also Prog. Phys. Org. Chem., 1987, 16, 1. [all data]