pCOMe-benzoate anion

Reaction thermochemistry data

Data compiled by: John E. Bartmess

Individual Reactions

C9H7O3- + Hydrogen cation = 4-Acetylbenzoic acid

By formula: C9H7O3- + H+ = C9H8O3

Quantity Value Units Method Reference Comment
Δr1399. ± 8.8kJ/molG+TSTaft and Topsom, 1987gas phase; value altered from reference due to change in acidity scale
Quantity Value Units Method Reference Comment
Δr1369. ± 8.4kJ/molIMRETaft and Topsom, 1987gas phase; value altered from reference due to change in acidity scale

Gas phase ion energetics data

Data compiled by: John E. Bartmess

Electron affinity of neutral species

EAneutral (eV) Method Reference Comment
4.00 ± 0.16D-EATaft and Topsom, 1987value altered from reference due to change in acidity scale

Protonation reactions

C9H7O3- + Hydrogen cation = 4-Acetylbenzoic acid

By formula: C9H7O3- + H+ = C9H8O3

Quantity Value Units Method Reference Comment
Δr1399. ± 8.8kJ/molG+TSTaft and Topsom, 1987gas phase; value altered from reference due to change in acidity scale
Quantity Value Units Method Reference Comment
Δr1369. ± 8.4kJ/molIMRETaft and Topsom, 1987gas phase; value altered from reference due to change in acidity scale

References

Taft and Topsom, 1987
Taft, R.W.; Topsom, R.D., The Nature and Analysis of Substituent Effects, Prog. Phys. Org. Chem., 1987, 16, 1. [all data]