pMe-C6H4C(CN)2 anion

Reaction thermochemistry data

Data compiled by: John E. Bartmess

Individual Reactions

C10H7N2- + Hydrogen cation = C10H8N2

By formula: C10H7N2- + H+ = C10H8N2

Quantity Value Units Method Reference Comment
Δr323.0 ± 2.2kcal/molG+TSKoppel, Taft, et al., 1994gas phase
Quantity Value Units Method Reference Comment
Δr315.7 ± 2.0kcal/molIMREKoppel, Taft, et al., 1994gas phase
Δr316.1 ± 2.0kcal/molIMREJinfeng, Topsom, et al., 1988gas phase; value altered from reference due to change in acidity scale

References

Koppel, Taft, et al., 1994
Koppel, I.A.; Taft, R.W.; Anvia, F.; Zhu, S.Z.; Hu, L.Q.; Sung, K.S.; Desmarteau, D.D.; Yagupolskii, L.M., The Gas-Phase Acidities of Very Strong Neutral Bronsted Acids, J. Am. Chem. Soc., 1994, 116, 7, 3047, https://doi.org/10.1021/ja00086a038 . [all data]

Jinfeng, Topsom, et al., 1988
Jinfeng, C.; Topsom, R.D.; Headley, A.D.; Koppel, I.; Mishima, M.; Taft, R.W.; Veji, S., Acidities of Substituted Acetic Acids, J. Mol. Struct., 1988, 168, 141, https://doi.org/10.1016/0166-1280(88)80349-X . [all data]