4-Me-bicyclo[2.2.2]octene-CO2 anion

Reaction thermochemistry data

Data compiled by: John E. Bartmess

Individual Reactions

C10H13O2- + Hydrogen cation = C10H14O2

By formula: C10H13O2- + H+ = C10H14O2

Quantity Value Units Method Reference Comment
Δr341.4 ± 2.2kcal/molG+TSTaft and Topsom, 1987gas phase; value altered from reference due to change in acidity scale
Quantity Value Units Method Reference Comment
Δr334.4 ± 2.0kcal/molIMRETaft and Topsom, 1987gas phase; value altered from reference due to change in acidity scale

Gas phase ion energetics data

Data compiled by: John E. Bartmess

Electron affinity of neutral species

EAneutral (eV) Method Reference Comment
3.69 ± 0.16D-EATaft and Topsom, 1987value altered from reference due to change in acidity scale

Protonation reactions

C10H13O2- + Hydrogen cation = C10H14O2

By formula: C10H13O2- + H+ = C10H14O2

Quantity Value Units Method Reference Comment
Δr341.4 ± 2.2kcal/molG+TSTaft and Topsom, 1987gas phase; value altered from reference due to change in acidity scale
Quantity Value Units Method Reference Comment
Δr334.4 ± 2.0kcal/molIMRETaft and Topsom, 1987gas phase; value altered from reference due to change in acidity scale

References

Taft and Topsom, 1987
Taft, R.W.; Topsom, R.D., The Nature and Analysis of Substituent Effects, Prog. Phys. Org. Chem., 1987, 16, 1. [all data]