oOH-benzoate anion

Reaction thermochemistry data

Data compiled by: John E. Bartmess

Individual Reactions

C7H5O3- + Hydrogen cation = Salicylic acid

By formula: C7H5O3- + H+ = C7H6O3

Quantity Value Units Method Reference Comment
Δr325.5 ± 2.2kcal/molG+TSKebarle and McMahon, 1977gas phase
Quantity Value Units Method Reference Comment
Δr317.8 ± 2.0kcal/molIMREKebarle and McMahon, 1977gas phase

References

Kebarle and McMahon, 1977
Kebarle, P.; McMahon, T.B., Intrinsic Acidities of Substituted Phenols and Benzoic Acids Determined by Gas Phase Proton Transfer Equilibria, J. Am. Chem. Soc., 1977, 99, 7, 2222, https://doi.org/10.1021/ja00449a032 . [all data]