mNO2-benzoate anion

Reaction thermochemistry data

Data compiled by: John E. Bartmess

Individual Reactions

C7H4NO4- + Hydrogen cation = Benzoic acid, 3-nitro-

By formula: C7H4NO4- + H+ = C7H5NO4

Quantity Value Units Method Reference Comment
Δr1377. ± 8.8kJ/molG+TSTaft, 1987gas phase; value altered from reference due to change in acidity scale
Δr1377. ± 8.8kJ/molG+TSKebarle and McMahon, 1977gas phase
Quantity Value Units Method Reference Comment
Δr1347. ± 8.4kJ/molIMRETaft, 1987gas phase; value altered from reference due to change in acidity scale
Δr1348. ± 8.4kJ/molIMREKebarle and McMahon, 1977gas phase

Gas phase ion energetics data

Data compiled by: John E. Bartmess

Electron affinity of neutral species

EAneutral (eV) Method Reference Comment
4.23 ± 0.16D-EAKebarle and McMahon, 1977

Protonation reactions

C7H4NO4- + Hydrogen cation = Benzoic acid, 3-nitro-

By formula: C7H4NO4- + H+ = C7H5NO4

Quantity Value Units Method Reference Comment
Δr1377. ± 8.8kJ/molG+TSTaft, 1987gas phase; value altered from reference due to change in acidity scale
Δr1377. ± 8.8kJ/molG+TSKebarle and McMahon, 1977gas phase
Quantity Value Units Method Reference Comment
Δr1347. ± 8.4kJ/molIMRETaft, 1987gas phase; value altered from reference due to change in acidity scale
Δr1348. ± 8.4kJ/molIMREKebarle and McMahon, 1977gas phase

References

Taft, 1987
Taft, R.W., The Nature and Analysis of Substitutent Electronic Effects, Personal communication. See also Prog. Phys. Org. Chem., 1987, 16, 1. [all data]

Kebarle and McMahon, 1977
Kebarle, P.; McMahon, T.B., Intrinsic Acidities of Substituted Phenols and Benzoic Acids Determined by Gas Phase Proton Transfer Equilibria, J. Am. Chem. Soc., 1977, 99, 7, 2222, https://doi.org/10.1021/ja00449a032 . [all data]