mF-benzoate anion

Gas phase ion energetics data

Data compiled by: John E. Bartmess

Electron affinity of neutral species

EAneutral (eV) Method Reference Comment
3.92 ± 0.16D-EAKebarle and McMahon, 1977

Protonation reactions

C7H4FO2- + Hydrogen cation = Benzoic acid, 3-fluoro-

By formula: C7H4FO2- + H+ = C7H5FO2

Quantity Value Units Method Reference Comment
Δr1406. ± 8.8kJ/molG+TSKebarle and McMahon, 1977gas phase
Quantity Value Units Method Reference Comment
Δr1377. ± 8.4kJ/molIMREKebarle and McMahon, 1977gas phase

References

Kebarle and McMahon, 1977
Kebarle, P.; McMahon, T.B., Intrinsic Acidities of Substituted Phenols and Benzoic Acids Determined by Gas Phase Proton Transfer Equilibria, J. Am. Chem. Soc., 1977, 99, 7, 2222, https://doi.org/10.1021/ja00449a032 . [all data]