oNH2-benzoate anion

Gas phase ion energetics data

Data compiled by: John E. Bartmess

Electron affinity of neutral species

EAneutral (eV) Method Reference Comment
3.87 ± 0.16D-EAKebarle and McMahon, 1977

Protonation reactions

C7H6NO2- + Hydrogen cation = Benzoic acid, 2-amino-

By formula: C7H6NO2- + H+ = C7H7NO2

Quantity Value Units Method Reference Comment
Δr1411. ± 9.2kJ/molG+TSKebarle and McMahon, 1977gas phase
Quantity Value Units Method Reference Comment
Δr1382. ± 8.4kJ/molIMREKebarle and McMahon, 1977gas phase

Reaction thermochemistry data

Data compiled by: John E. Bartmess

Individual Reactions

C7H6NO2- + Hydrogen cation = Benzoic acid, 2-amino-

By formula: C7H6NO2- + H+ = C7H7NO2

Quantity Value Units Method Reference Comment
Δr337.3 ± 2.2kcal/molG+TSKebarle and McMahon, 1977gas phase
Quantity Value Units Method Reference Comment
Δr330.2 ± 2.0kcal/molIMREKebarle and McMahon, 1977gas phase

References

Kebarle and McMahon, 1977
Kebarle, P.; McMahon, T.B., Intrinsic Acidities of Substituted Phenols and Benzoic Acids Determined by Gas Phase Proton Transfer Equilibria, J. Am. Chem. Soc., 1977, 99, 7, 2222, https://doi.org/10.1021/ja00449a032 . [all data]