oMe-benzoate anion
- Formula: C8H7O2-
- Molecular weight: 135.1405

Reaction thermochemistry data

Data compiled by: John E. Bartmess
Individual Reactions
By formula: C8H7O2- + H+ = C8H8O2
Quantity | Value | Units | Method | Reference | Comment |
---|---|---|---|---|---|
ΔrH° | 1419. ± 9.2 | kJ/mol | G+TS | Kebarle and McMahon, 1977 | gas phase |
Quantity | Value | Units | Method | Reference | Comment |
ΔrG° | 1390. ± 8.4 | kJ/mol | IMRE | Kebarle and McMahon, 1977 | gas phase |
ΔrG° | 1391. ± 8.4 | kJ/mol | IMRE | Decouzon, Ertl, et al., 1993 | gas phase |
By formula: C8H7O2- + C5FeO5 = (C8H7O2- • C5FeO5)
Quantity | Value | Units | Method | Reference | Comment |
---|---|---|---|---|---|
ΔrH° | 188. ± 25. | kJ/mol | IMRB | Lane, Sallans, et al., 1985 | gas phase |
Quantity | Value | Units | Method | Reference | Comment |
ΔrG° | 149. ± 25. | kJ/mol | IMRB | Lane, Sallans, et al., 1985 | gas phase |

Ion clustering data

Data compiled by: John E. Bartmess
Clustering reactions
By formula: C8H7O2- + C5FeO5 = (C8H7O2- • C5FeO5)
Quantity | Value | Units | Method | Reference | Comment |
---|---|---|---|---|---|
ΔrH° | 188. ± 25. | kJ/mol | IMRB | Lane, Sallans, et al., 1985 | gas phase |
Quantity | Value | Units | Method | Reference | Comment |
ΔrG° | 149. ± 25. | kJ/mol | IMRB | Lane, Sallans, et al., 1985 | gas phase |

References

Kebarle and McMahon, 1977
Kebarle, P.; McMahon, T.B.,
Intrinsic Acidities of Substituted Phenols and Benzoic Acids Determined by Gas Phase Proton Transfer Equilibria,
J. Am. Chem. Soc., 1977, 99, 7, 2222, https://doi.org/10.1021/ja00449a032
. [all data]
Decouzon, Ertl, et al., 1993
Decouzon, M.; Ertl, P.; Exner, O.; Gal, J.F.; Maria, P.C.,
Concepts of Sterically Hindered Resonance and Buttressing Effect - Gas-Phase Acidities of Methyl-Substituted Benzoic Acids and Basicities of,
J. Am. Chem. Soc., 1993, 115, 25, 12071, https://doi.org/10.1021/ja00078a052
. [all data]
Lane, Sallans, et al., 1985
Lane, K.R.; Sallans, L.; Squires, R.R.,
Anion affinities of transition metal carbonyls. A thermochemical correlation for iron tetracarbonyl acyl negative ions,
J. Am. Chem. Soc., 1985, 107, 5369. [all data]