GeF3 anion

Gas phase ion energetics data

Data compiled by: John E. Bartmess

Electron affinity of neutral species

EAneutral (eV) Method Reference Comment
3.10 ± 0.10EIAEHarland, Cradock, et al., 1972From GeF4. Calculations ( Morgon and Riveros, 1998) give EA = 3.5-3.7 eV
1.60001EIAEFranklin, Wang, et al., 1974From GeF4. Calculations ( Morgon and Riveros, 1998) give EA = 3.5-3.7 eV
1.11 ± 0.43EIAEWang, Margrave, et al., 1974From GeF4. Calculations ( Morgon and Riveros, 1998) give EA = 3.5-3.7 eV

References

Harland, Cradock, et al., 1972
Harland, P.W.; Cradock, S.; Thynne, J.C.J., Positive- and negative-ion formation due to the electron bombardment of germanium tetrafluoride, Int. J. Mass Spectrom. Ion Phys., 1972, 10, 169. [all data]

Morgon and Riveros, 1998
Morgon, N.H.; Riveros, J.M., Calculation of the proton and electron affinity of simple Ge-containing species using density functional theory, J. Phys. Chem. A, 1998, 102, 50, 10399-10403, https://doi.org/10.1021/jp9828585 . [all data]

Franklin, Wang, et al., 1974
Franklin, J.L.; Wang, J.L.-F.; Bennett, S.L.; Harland, P.W.; Margrave, J.L., Studies of the energies of negative ions at high temperatures, Adv. Mass Spectrom., 1974, 6, 319. [all data]

Wang, Margrave, et al., 1974
Wang, J.L.-F.; Margrave, J.L.; Franklin, J.L., Enthalpy of formation of germanium trifluoride, J. Chem. Phys., 1974, 60, 2158. [all data]