2-Ph-5-p-tolyl-cyclopentadienide anion

Reaction thermochemistry data

Data compiled by: John E. Bartmess

Individual Reactions

C18H15- + Hydrogen cation = C18H16

By formula: C18H15- + H+ = C18H16

Quantity Value Units Method Reference Comment
Δr337.5 ± 2.1kcal/molG+TSTaft, 1987gas phase; value altered from reference due to change in acidity scale
Quantity Value Units Method Reference Comment
Δr330.1 ± 2.0kcal/molIMRETaft, 1987gas phase; value altered from reference due to change in acidity scale

References

Taft, 1987
Taft, R.W., The Nature and Analysis of Substitutent Electronic Effects, Personal communication. See also Prog. Phys. Org. Chem., 1987, 16, 1. [all data]