3-Me-pyrazolide anion

Gas phase ion energetics data

Data compiled by: John E. Bartmess

Protonation reactions

C4H5N2- + Hydrogen cation = 1H-Pyrazole, 3-methyl-

By formula: C4H5N2- + H+ = C4H6N2

Quantity Value Units Method Reference Comment
Δr356.0 ± 2.1kcal/molG+TSTaft, 1991gas phase
Quantity Value Units Method Reference Comment
Δr348.3 ± 2.0kcal/molIMRETaft, 1991gas phase

References

Taft, 1991
Taft, R.W., , personal communication, Aug, 1991. [all data]