PhNEt anion

Reaction thermochemistry data

Data compiled by: John E. Bartmess

Individual Reactions

C8H10N- + Hydrogen cation = Benzenamine, N-ethyl-

By formula: C8H10N- + H+ = C8H11N

Quantity Value Units Method Reference Comment
Δr1523. ± 8.8kJ/molG+TSTaft, 1987gas phase; value altered from reference due to change in acidity scale
Quantity Value Units Method Reference Comment
Δr1493. ± 8.4kJ/molIMRETaft, 1987gas phase; value altered from reference due to change in acidity scale

References

Taft, 1987
Taft, R.W., The Nature and Analysis of Substitutent Electronic Effects, Personal communication. See also Prog. Phys. Org. Chem., 1987, 16, 1. [all data]