PhN=C(CF3)O anion

Gas phase ion energetics data

Data compiled by: John E. Bartmess

Protonation reactions

C8H5F3NO- + Hydrogen cation = Acetamide, 2,2,2-trifluoro-N-phenyl-

By formula: C8H5F3NO- + H+ = C8H6F3NO

Quantity Value Units Method Reference Comment
Δr333.4 ± 2.1kcal/molG+TSTaft and Bordwell, 1988gas phase
Quantity Value Units Method Reference Comment
Δr326.4 ± 2.0kcal/molIMRETaft and Bordwell, 1988gas phase

References

Taft and Bordwell, 1988
Taft, R.W.; Bordwell, F.G., Structural and Solvent Effects Evaluated from Acidities Measured in Dimethyl Sulfoxide and in the Gas Phase, Acc. Chem. Res., 1988, 21, 12, 463, https://doi.org/10.1021/ar00156a005 . [all data]