HN=C(CF3)O anion

Gas phase ion energetics data

Data compiled by: John E. Bartmess

Protonation reactions

C2HF3NO- + Hydrogen cation = Acetamide, 2,2,2-trifluoro-

By formula: C2HF3NO- + H+ = C2H2F3NO

Quantity Value Units Method Reference Comment
Δr343.7 ± 2.1kcal/molG+TSTaft and Bordwell, 1988gas phase
Quantity Value Units Method Reference Comment
Δr336.7 ± 2.0kcal/molIMRETaft and Bordwell, 1988gas phase

References

Taft and Bordwell, 1988
Taft, R.W.; Bordwell, F.G., Structural and Solvent Effects Evaluated from Acidities Measured in Dimethyl Sulfoxide and in the Gas Phase, Acc. Chem. Res., 1988, 21, 12, 463, https://doi.org/10.1021/ar00156a005 . [all data]