HN=C(Ph)O anion

Gas phase ion energetics data

Data compiled by: John E. Bartmess

Protonation reactions

C7H6NO- + Hydrogen cation = Benzamide

By formula: C7H6NO- + H+ = C7H7NO

Quantity Value Units Method Reference Comment
Δr1481. ± 8.8kJ/molG+TSTaft, 1987gas phase; value altered from reference due to change in acidity scale
Quantity Value Units Method Reference Comment
Δr1452. ± 8.4kJ/molIMRETaft, 1987gas phase; value altered from reference due to change in acidity scale

References

Taft, 1987
Taft, R.W., The Nature and Analysis of Substitutent Electronic Effects, Personal communication. See also Prog. Phys. Org. Chem., 1987, 16, 1. [all data]