HN=C(tBu)O anion

Reaction thermochemistry data

Data compiled by: John E. Bartmess

Individual Reactions

C5H10NO- + Hydrogen cation = Propanamide, 2,2-dimethyl-

By formula: C5H10NO- + H+ = C5H11NO

Quantity Value Units Method Reference Comment
Δr1498. ± 8.8kJ/molG+TSTaft, 1987gas phase; value altered from reference due to change in acidity scale
Quantity Value Units Method Reference Comment
Δr1469. ± 8.4kJ/molIMRETaft, 1987gas phase; value altered from reference due to change in acidity scale

Gas phase ion energetics data

Data compiled by: John E. Bartmess

Protonation reactions

C5H10NO- + Hydrogen cation = Propanamide, 2,2-dimethyl-

By formula: C5H10NO- + H+ = C5H11NO

Quantity Value Units Method Reference Comment
Δr1498. ± 8.8kJ/molG+TSTaft, 1987gas phase; value altered from reference due to change in acidity scale
Quantity Value Units Method Reference Comment
Δr1469. ± 8.4kJ/molIMRETaft, 1987gas phase; value altered from reference due to change in acidity scale

References

Taft, 1987
Taft, R.W., The Nature and Analysis of Substitutent Electronic Effects, Personal communication. See also Prog. Phys. Org. Chem., 1987, 16, 1. [all data]