HN=C(NH2)O anion

Reaction thermochemistry data

Data compiled by: John E. Bartmess

Individual Reactions

CH3N2O- + Hydrogen cation = Urea

By formula: CH3N2O- + H+ = CH4N2O

Quantity Value Units Method Reference Comment
Δr361.8 ± 2.8kcal/molCIDCMa, Wang, et al., 1998gas phase; H and S (20.5±1.8 eu) directly from kinetic method
Δr362.5 ± 2.6kcal/molG+TSTaft, 1987gas phase; value altered from reference due to change in acidity scale
Δr357.4 ± 2.1kcal/molEIAEMuftakhov, Vasil'ev, et al., 1999gas phase
Quantity Value Units Method Reference Comment
Δr355.7 ± 3.2kcal/molH-TSMa, Wang, et al., 1998gas phase; H and S (20.5±1.8 eu) directly from kinetic method
Δr355.5 ± 2.5kcal/molIMRETaft, 1987gas phase; value altered from reference due to change in acidity scale

Gas phase ion energetics data

Data compiled by: John E. Bartmess

Protonation reactions

CH3N2O- + Hydrogen cation = Urea

By formula: CH3N2O- + H+ = CH4N2O

Quantity Value Units Method Reference Comment
Δr361.8 ± 2.8kcal/molCIDCMa, Wang, et al., 1998gas phase; H and S (20.5±1.8 eu) directly from kinetic method
Δr362.5 ± 2.6kcal/molG+TSTaft, 1987gas phase; value altered from reference due to change in acidity scale
Δr357.4 ± 2.1kcal/molEIAEMuftakhov, Vasil'ev, et al., 1999gas phase
Quantity Value Units Method Reference Comment
Δr355.7 ± 3.2kcal/molH-TSMa, Wang, et al., 1998gas phase; H and S (20.5±1.8 eu) directly from kinetic method
Δr355.5 ± 2.5kcal/molIMRETaft, 1987gas phase; value altered from reference due to change in acidity scale

References

Ma, Wang, et al., 1998
Ma, S.G.; Wang, F.; Cooks, R.G., Gas-phase acidity of urea, J. Mass Spectrom., 1998, 33, 10, 943-949, https://doi.org/10.1002/(SICI)1096-9888(1998100)33:10<943::AID-JMS703>3.0.CO;2-B . [all data]

Taft, 1987
Taft, R.W., The Nature and Analysis of Substitutent Electronic Effects, Personal communication. See also Prog. Phys. Org. Chem., 1987, 16, 1. [all data]

Muftakhov, Vasil'ev, et al., 1999
Muftakhov, M.V.; Vasil'ev, Y.V.; Mazunov, V.A., Determination of electron affinity of carbonyl radicals by means of negative ion mass spectrometry, Rapid Commun. Mass Spectrom., 1999, 13, 12, 1104-1108, https://doi.org/10.1002/(SICI)1097-0231(19990630)13:12<1104::AID-RCM619>3.0.CO;2-C . [all data]