HN=C(Me)O anion

Reaction thermochemistry data

Data compiled by: John E. Bartmess

Individual Reactions

C2H4NO- + Hydrogen cation = Acetamide

By formula: C2H4NO- + H+ = C2H5NO

Quantity Value Units Method Reference Comment
Δr362.0 ± 2.1kcal/molG+TSDecouzon, Exner, et al., 1990gas phase; value altered from reference due to change in acidity scale
Δr358.6 ± 1.2kcal/molEIAEMuftakhov, Vasil'ev, et al., 1999gas phase
Quantity Value Units Method Reference Comment
Δr355.0 ± 2.0kcal/molIMREDecouzon, Exner, et al., 1990gas phase; value altered from reference due to change in acidity scale

References

Decouzon, Exner, et al., 1990
Decouzon, M.; Exner, O.; Gal, J.-F.; Maria, P.-C., The Gas-Phase Acidity and the Acidic Site of Acetohydroxamic Acid: an FT-ICR Study, J. Org. Chem., 1990, 55, 13, 3980, https://doi.org/10.1021/jo00300a007 . [all data]

Muftakhov, Vasil'ev, et al., 1999
Muftakhov, M.V.; Vasil'ev, Y.V.; Mazunov, V.A., Determination of electron affinity of carbonyl radicals by means of negative ion mass spectrometry, Rapid Commun. Mass Spectrom., 1999, 13, 12, 1104-1108, https://doi.org/10.1002/(SICI)1097-0231(19990630)13:12<1104::AID-RCM619>3.0.CO;2-C . [all data]