iBuCO2 anion

Gas phase ion energetics data

Data compiled by: John E. Bartmess

Electron affinity of neutral species

EAneutral (eV) Method Reference Comment
3.52 ± 0.16D-EACaldwell, Renneboog, et al., 1989

Protonation reactions

C5H9O2- + Hydrogen cation = Butanoic acid, 3-methyl-

By formula: C5H9O2- + H+ = C5H10O2

Quantity Value Units Method Reference Comment
Δr1446. ± 8.8kJ/molG+TSCaldwell, Renneboog, et al., 1989gas phase
Δr1451. ± 8.8kJ/molG+TSTaft and Topsom, 1987gas phase
Quantity Value Units Method Reference Comment
Δr1416. ± 8.4kJ/molIMRECaldwell, Renneboog, et al., 1989gas phase
Δr1421. ± 8.4kJ/molIMRETaft and Topsom, 1987gas phase

Reaction thermochemistry data

Data compiled by: John E. Bartmess

Individual Reactions

C5H9O2- + Hydrogen cation = Butanoic acid, 3-methyl-

By formula: C5H9O2- + H+ = C5H10O2

Quantity Value Units Method Reference Comment
Δr1446. ± 8.8kJ/molG+TSCaldwell, Renneboog, et al., 1989gas phase
Δr1451. ± 8.8kJ/molG+TSTaft and Topsom, 1987gas phase
Quantity Value Units Method Reference Comment
Δr1416. ± 8.4kJ/molIMRECaldwell, Renneboog, et al., 1989gas phase
Δr1421. ± 8.4kJ/molIMRETaft and Topsom, 1987gas phase

References

Caldwell, Renneboog, et al., 1989
Caldwell, G.; Renneboog, R.; Kebarle, P., Gas Phase Acidities of Aliphatic Carboxylic Acids, Based on Measurements of Proton Transfer Equilibria, Can. J. Chem., 1989, 67, 4, 661, https://doi.org/10.1139/v89-092 . [all data]

Taft and Topsom, 1987
Taft, R.W.; Topsom, R.D., The Nature and Analysis of Substituent Effects, Prog. Phys. Org. Chem., 1987, 16, 1. [all data]