9-tBuCH2-fluorenide anion

Reaction thermochemistry data

Data compiled by: John E. Bartmess

Individual Reactions

C18H19- + Hydrogen cation = C18H20

By formula: C18H19- + H+ = C18H20

Quantity Value Units Method Reference Comment
Δr1452. ± 8.8kJ/molG+TSTaft and Bordwell, 1988gas phase
Quantity Value Units Method Reference Comment
Δr1419. ± 8.4kJ/molIMRETaft and Bordwell, 1988gas phase

Gas phase ion energetics data

Data compiled by: John E. Bartmess

Protonation reactions

C18H19- + Hydrogen cation = C18H20

By formula: C18H19- + H+ = C18H20

Quantity Value Units Method Reference Comment
Δr1452. ± 8.8kJ/molG+TSTaft and Bordwell, 1988gas phase
Quantity Value Units Method Reference Comment
Δr1419. ± 8.4kJ/molIMRETaft and Bordwell, 1988gas phase

References

Taft and Bordwell, 1988
Taft, R.W.; Bordwell, F.G., Structural and Solvent Effects Evaluated from Acidities Measured in Dimethyl Sulfoxide and in the Gas Phase, Acc. Chem. Res., 1988, 21, 12, 463, https://doi.org/10.1021/ar00156a005 . [all data]