9-Et-fluorenide anion

Reaction thermochemistry data

Data compiled by: John E. Bartmess

Individual Reactions

C15H13- + Hydrogen cation = 9-Ethylfluorene

By formula: C15H13- + H+ = C15H14

Quantity Value Units Method Reference Comment
Δr351.1 ± 2.1kcal/molG+TSTaft, 1987gas phase; value altered from reference due to change in acidity scale
Quantity Value Units Method Reference Comment
Δr343.4 ± 2.0kcal/molIMRETaft, 1987gas phase; value altered from reference due to change in acidity scale

References

Taft, 1987
Taft, R.W., The Nature and Analysis of Substitutent Electronic Effects, Personal communication. See also Prog. Phys. Org. Chem., 1987, 16, 1. [all data]