9-tBu-fluorenide anion

Reaction thermochemistry data

Data compiled by: John E. Bartmess

Individual Reactions

C17H17- + Hydrogen cation = C17H18

By formula: C17H17- + H+ = C17H18

Quantity Value Units Method Reference Comment
Δr1468. ± 8.8kJ/molG+TSTaft and Bordwell, 1988gas phase
Quantity Value Units Method Reference Comment
Δr1438. ± 8.4kJ/molIMRETaft and Bordwell, 1988gas phase

Gas phase ion energetics data

Data compiled by: John E. Bartmess

Protonation reactions

C17H17- + Hydrogen cation = C17H18

By formula: C17H17- + H+ = C17H18

Quantity Value Units Method Reference Comment
Δr1468. ± 8.8kJ/molG+TSTaft and Bordwell, 1988gas phase
Quantity Value Units Method Reference Comment
Δr1438. ± 8.4kJ/molIMRETaft and Bordwell, 1988gas phase

References

Taft and Bordwell, 1988
Taft, R.W.; Bordwell, F.G., Structural and Solvent Effects Evaluated from Acidities Measured in Dimethyl Sulfoxide and in the Gas Phase, Acc. Chem. Res., 1988, 21, 12, 463, https://doi.org/10.1021/ar00156a005 . [all data]