pentaMe-cyclopentadienide anion

Reaction thermochemistry data

Data compiled by: John E. Bartmess

Individual Reactions

C10H15- + Hydrogen cation = 1,3-Cyclopentadiene, 1,2,3,4,5-pentamethyl-

By formula: C10H15- + H+ = C10H16

Quantity Value Units Method Reference Comment
Δr1510. ± 9.2kJ/molG+TSTaft, 1987gas phase; value altered from reference due to change in acidity scale
Quantity Value Units Method Reference Comment
Δr1485. ± 8.4kJ/molIMRETaft, 1987gas phase; value altered from reference due to change in acidity scale

Gas phase ion energetics data

Data compiled by: John E. Bartmess

Electron affinity of neutral species

EAneutral (eV) Method Reference Comment
1.29 ± 0.13D-EATaft, 1987value altered from reference due to change in acidity scale

Protonation reactions

C10H15- + Hydrogen cation = 1,3-Cyclopentadiene, 1,2,3,4,5-pentamethyl-

By formula: C10H15- + H+ = C10H16

Quantity Value Units Method Reference Comment
Δr360.8 ± 2.2kcal/molG+TSTaft, 1987gas phase; value altered from reference due to change in acidity scale
Quantity Value Units Method Reference Comment
Δr355.0 ± 2.0kcal/molIMRETaft, 1987gas phase; value altered from reference due to change in acidity scale

References

Taft, 1987
Taft, R.W., The Nature and Analysis of Substitutent Electronic Effects, Personal communication. See also Prog. Phys. Org. Chem., 1987, 16, 1. [all data]