AsF2 anion

Gas phase thermochemistry data

Data compiled by: John E. Bartmess

Quantity Value Units Method Reference Comment
Δfgas-542.66kJ/molEIAEPabst, Bennett, et al., 1976From AsF3.

References

Pabst, Bennett, et al., 1976
Pabst, R.E.; Bennett, S.L.; Franklin, J.L.; Margrave, J.L., Negative ion electron impact studies of arsenic trihalides: AsF3, AsCl3, and AsBr3, J. Chem. Phys., 1976, 64, 1550. [all data]