cC6H11-CH2S anion

Gas phase ion energetics data

Data compiled by: John E. Bartmess

Electron affinity of neutral species

EAneutral (eV) Method Reference Comment
2.09 ± 0.14D-EATaft, 1987value altered from reference due to change in acidity scale

Protonation reactions

C7H13S- + Hydrogen cation = Cyclohexanemethanethiol

By formula: C7H13S- + H+ = C7H14S

Quantity Value Units Method Reference Comment
Δr352.6 ± 2.2kcal/molG+TSTaft, 1987gas phase; value altered from reference due to change in acidity scale
Quantity Value Units Method Reference Comment
Δr346.3 ± 2.0kcal/molIMRETaft, 1987gas phase; value altered from reference due to change in acidity scale

References

Taft, 1987
Taft, R.W., The Nature and Analysis of Substitutent Electronic Effects, Personal communication. See also Prog. Phys. Org. Chem., 1987, 16, 1. [all data]