iBuS anion

Reaction thermochemistry data

Data compiled by: John E. Bartmess

Individual Reactions

C4H9S- + Hydrogen cation = 1-Propanethiol, 2-methyl-

By formula: C4H9S- + H+ = C4H10S

Quantity Value Units Method Reference Comment
Δr1477. ± 9.2kJ/molG+TSTaft, 1987gas phase; value altered from reference due to change in acidity scale
Quantity Value Units Method Reference Comment
Δr1451. ± 8.4kJ/molIMRETaft, 1987gas phase; value altered from reference due to change in acidity scale

Gas phase ion energetics data

Data compiled by: John E. Bartmess

Electron affinity of neutral species

EAneutral (eV) Method Reference Comment
2.07 ± 0.14D-EATaft, 1987value altered from reference due to change in acidity scale

Protonation reactions

C4H9S- + Hydrogen cation = 1-Propanethiol, 2-methyl-

By formula: C4H9S- + H+ = C4H10S

Quantity Value Units Method Reference Comment
Δr1477. ± 9.2kJ/molG+TSTaft, 1987gas phase; value altered from reference due to change in acidity scale
Quantity Value Units Method Reference Comment
Δr1451. ± 8.4kJ/molIMRETaft, 1987gas phase; value altered from reference due to change in acidity scale

References

Taft, 1987
Taft, R.W., The Nature and Analysis of Substitutent Electronic Effects, Personal communication. See also Prog. Phys. Org. Chem., 1987, 16, 1. [all data]