2-Cl-4-NO2-phenoxide anion

Reaction thermochemistry data

Data compiled by: John E. Bartmess

Individual Reactions

C6H3ClNO3- + Hydrogen cation = Phenol, 2-chloro-4-nitro-

By formula: C6H3ClNO3- + H+ = C6H4ClNO3

Quantity Value Units Method Reference Comment
Δr323.2 ± 2.1kcal/molG+TSKoppel, Taft, et al., 1994gas phase
Quantity Value Units Method Reference Comment
Δr316.1 ± 2.0kcal/molIMREKoppel, Taft, et al., 1994gas phase

Gas phase ion energetics data

Data compiled by: John E. Bartmess

Protonation reactions

C6H3ClNO3- + Hydrogen cation = Phenol, 2-chloro-4-nitro-

By formula: C6H3ClNO3- + H+ = C6H4ClNO3

Quantity Value Units Method Reference Comment
Δr323.2 ± 2.1kcal/molG+TSKoppel, Taft, et al., 1994gas phase
Quantity Value Units Method Reference Comment
Δr316.1 ± 2.0kcal/molIMREKoppel, Taft, et al., 1994gas phase

References

Koppel, Taft, et al., 1994
Koppel, I.A.; Taft, R.W.; Anvia, F.; Zhu, S.Z.; Hu, L.Q.; Sung, K.S.; Desmarteau, D.D.; Yagupolskii, L.M., The Gas-Phase Acidities of Very Strong Neutral Bronsted Acids, J. Am. Chem. Soc., 1994, 116, 7, 3047, https://doi.org/10.1021/ja00086a038 . [all data]