CH2=C(C6H4-mCl)O anion

Reaction thermochemistry data

Data compiled by: John E. Bartmess

Individual Reactions

C8H6ClO- + Hydrogen cation = Acetophenone, 3'-chloro-

By formula: C8H6ClO- + H+ = C8H7ClO

Quantity Value Units Method Reference Comment
Δr357.2 ± 2.1kcal/molG+TSBartmess, Scott, et al., 1979gas phase; value altered from reference due to change in acidity scale
Quantity Value Units Method Reference Comment
Δr350.4 ± 2.0kcal/molIMREBartmess, Scott, et al., 1979gas phase; value altered from reference due to change in acidity scale

Gas phase ion energetics data

Data compiled by: John E. Bartmess

Protonation reactions

C8H6ClO- + Hydrogen cation = Acetophenone, 3'-chloro-

By formula: C8H6ClO- + H+ = C8H7ClO

Quantity Value Units Method Reference Comment
Δr357.2 ± 2.1kcal/molG+TSBartmess, Scott, et al., 1979gas phase; value altered from reference due to change in acidity scale
Quantity Value Units Method Reference Comment
Δr350.4 ± 2.0kcal/molIMREBartmess, Scott, et al., 1979gas phase; value altered from reference due to change in acidity scale

References

Bartmess, Scott, et al., 1979
Bartmess, J.E.; Scott, J.A.; McIver, R.T., Jr., The gas phase acidity scale from methanol to phenol, J. Am. Chem. Soc., 1979, 101, 6047. [all data]