oNH2-phenoxide anion

Reaction thermochemistry data

Data compiled by: John E. Bartmess

Individual Reactions

C6H6NO- + Hydrogen cation = Phenol, o-amino-

By formula: C6H6NO- + H+ = C6H7NO

Quantity Value Units Method Reference Comment
Δr1460. ± 8.8kJ/molG+TSKebarle and McMahon, 1977gas phase
Quantity Value Units Method Reference Comment
Δr1428. ± 8.4kJ/molIMREKebarle and McMahon, 1977gas phase

Gas phase ion energetics data

Data compiled by: John E. Bartmess

Electron affinity of neutral species

EAneutral (eV) Method Reference Comment
2.00 ± 0.14D-EAKebarle and McMahon, 1977

Protonation reactions

C6H6NO- + Hydrogen cation = Phenol, o-amino-

By formula: C6H6NO- + H+ = C6H7NO

Quantity Value Units Method Reference Comment
Δr1460. ± 8.8kJ/molG+TSKebarle and McMahon, 1977gas phase
Quantity Value Units Method Reference Comment
Δr1428. ± 8.4kJ/molIMREKebarle and McMahon, 1977gas phase

References

Kebarle and McMahon, 1977
Kebarle, P.; McMahon, T.B., Intrinsic Acidities of Substituted Phenols and Benzoic Acids Determined by Gas Phase Proton Transfer Equilibria, J. Am. Chem. Soc., 1977, 99, 7, 2222, https://doi.org/10.1021/ja00449a032 . [all data]