CH2=CHNO2 radical anion

Gas phase thermochemistry data

Data compiled by: John E. Bartmess

Quantity Value Units Method Reference Comment
Δfgas<-24.6 ± 3.6kcal/molAcidBartmess, 1980Computations indicate HOF(A-) ca. -10, EA ca. 19 kcal/mol

Reaction thermochemistry data

Data compiled by: John E. Bartmess

Individual Reactions

C2H3NO2- + Ethane, nitro- = C4H8N2O4-

By formula: C2H3NO2- + C2H5NO2 = C4H8N2O4-

Quantity Value Units Method Reference Comment
Δr15.70 ± 0.80kcal/molTDAsWincel, 2004gas phase
Quantity Value Units Method Reference Comment
Δr8.50kcal/molTDAsWincel, 2004gas phase

Ion clustering data

Data compiled by: John E. Bartmess

Clustering reactions

C2H3NO2- + Ethane, nitro- = C4H8N2O4-

By formula: C2H3NO2- + C2H5NO2 = C4H8N2O4-

Quantity Value Units Method Reference Comment
Δr15.70 ± 0.80kcal/molTDAsWincel, 2004gas phase
Quantity Value Units Method Reference Comment
Δr8.50kcal/molTDAsWincel, 2004gas phase

References

Bartmess, 1980
Bartmess, J.E., Solvent effects on ion-molecule reactions. Vinyl anions vs. conjugate addition, J. Am. Chem. Soc., 1980, 102, 2483. [all data]

Wincel, 2004
Wincel, H., Gas-phase clustering reactions of NO2-, C2H3NO2-, C2H4NO2-C2H5NO2- and C2H5NO4- with C2H5NO2, Int. J. Mass Spectrom., 2004, 232, 2, 185-194, https://doi.org/10.1016/j.ijms.2004.01.003 . [all data]