2,4-diF-anilide anion

Reaction thermochemistry data

Data compiled by: John E. Bartmess

Individual Reactions

C6H4F2N- + Hydrogen cation = 2,4-Difluoroaniline

By formula: C6H4F2N- + H+ = C6H5F2N

Quantity Value Units Method Reference Comment
Δr1510. ± 9.2kJ/molG+TSBartmess, Scott, et al., 1979gas phase; value altered from reference due to change in acidity scale
Quantity Value Units Method Reference Comment
Δr1480. ± 8.4kJ/molIMREBartmess, Scott, et al., 1979gas phase; value altered from reference due to change in acidity scale

Gas phase ion energetics data

Data compiled by: John E. Bartmess

Protonation reactions

C6H4F2N- + Hydrogen cation = 2,4-Difluoroaniline

By formula: C6H4F2N- + H+ = C6H5F2N

Quantity Value Units Method Reference Comment
Δr1510. ± 9.2kJ/molG+TSBartmess, Scott, et al., 1979gas phase; value altered from reference due to change in acidity scale
Quantity Value Units Method Reference Comment
Δr1480. ± 8.4kJ/molIMREBartmess, Scott, et al., 1979gas phase; value altered from reference due to change in acidity scale

References

Bartmess, Scott, et al., 1979
Bartmess, J.E.; Scott, J.A.; McIver, R.T., Jr., The gas phase acidity scale from methanol to phenol, J. Am. Chem. Soc., 1979, 101, 6047. [all data]